{"text_format":"1","workbook":"xlsx","n_sheets":20,"sheets":["Instructions","Budget and Setup","Pay Pool Panel","Bonus Adjustment Summary","Pay Bands","Hidden Config","Summary","Rating Statistics","Rating Charts","Hidden Sal Inc Rates","Salary Increase Statistics","Hidden Combo Chart","Salary Increase Charts","Total Salary Increase Charts","Bonus Statistics","Bonus Charts","OpenSheet","Hidden Work","Hidden Employee Notices","Hidden Employee Bonus Notices"],"not_rendered":{"charts":25,"images":28,"macros":1,"external_links":0,"defined_names":542,"comments":4,"pivot_tables":0},"unopened":[],"bounds":{"document_bytes":16777216,"sheet_cells":100000,"rows_first":2000,"rows_last":500,"rows_between":2000,"halvings":0,"cell_chars":16384,"cell_head_chars":4096},"cells_cut":0,"cells_raw":0,"read":"whole","date_system":"1900"}

{"sheet":"Instructions","index":0,"n_rows":56,"n_cols":8,"rows_kept":56,"cut":false,"hidden":false,"merged":[[1,2,1,11],[3,4,3,10],[2,4,2,10],[19,2,19,11],[15,2,15,11],[16,2,16,11],[18,2,18,11],[6,2,6,11],[4,2,4,11],[8,3,8,11],[14,3,14,11],[7,3,7,11],[11,3,11,11],[9,3,9,11],[10,3,10,11],[13,5,13,11]]}
[]
[null,null,"DCIPS Compensation Workbench (CWB)"]
[null,null,null,null,2024]
[null,null,null,null,"For Official Use Only\nInformation protected by the Privacy Act of 1974"]
[null,null,"This application will help DCIPS organizations conduct the DCIPS pay pool process."]
[]
{"$rows_left_out":51}
{"sheet":"Budget and Setup","index":1,"n_rows":87,"n_cols":11,"rows_kept":87,"cut":false,"hidden":false,"merged":[[1,3,1,4],[2,3,2,4],[3,3,3,4],[4,3,4,4],[79,2,80,4],[5,3,5,4],[56,2,58,7],[70,2,71,4],[76,2,77,4],[73,2,73,4]]}
[null,"Pay Pool Population and Salary Information",null,null,null,null,null,null,null,null,"Go to:"]
[null,null,null,"Population",null,null,"Sum of Base Salary",null,"Sum of Adjusted Salary"]
[null,null,"Entire PayPool",{"$f":"EmpCount","v":0},null,null,{"$f":"SUM(BasePay)","v":0},null,{"$f":"SUM(AdjSalary)","v":0}]
[null,null,"Rated",{"$f":"COUNTIF(Rating,\">0\")","v":0},null,null,{"$f":"SUMIF(Rating,\">0\",BasePay)","v":0},null,{"$f":"SUMIF(Rating,\">0\",AdjSalary)","v":0}]
[null,null,"Rated and Included in Salary Calculation",{"$f":"SUM((Rating>0)*(IncInSalFund=\"Yes\")*1)","v":0},null,null,{"$f":"SUM((Rating>0)*(IncInSalFund=\"Yes\")*BasePay)","v":0},null,{"$f":"SUM((Rating>0)*(IncInSalFund=\"Yes\")*AdjSalary)","v":0}]
[null,null,"Rated and Included in Bonus Calculation",{"$f":"SUM((Rating>0)*(IncInBonFunds=\"Yes\")*1)","v":0},null,null,{"$f":"SUM((Rating>0)*(IncInBonFunds=\"Yes\")*BasePay)","v":0},null,{"$f":"SUM((Rating>0)*(IncInBonFunds=\"Yes\")*AdjSalary)","v":0}]
{"$rows_left_out":82}
{"sheet":"Pay Pool Panel","index":2,"n_rows":31,"n_cols":165,"rows_kept":31,"cut":false,"hidden":false,"merged":[[2,158,3,167]]}
["Go To:",null,null,null,null,null,null,null,null,null,null,null,null,null,null,null,null,null,null,null,null,null,null,null,null,null,null,null,null,null,null,null,null,null,null,null,null,null,null,null,null,null,null,null,null,null,null,null,null,null,null,null,null,null,null,null,null,null,null,null,null,null,null,null,null,null,null,null,null,null,null,null,null,null,null,null,null,null,null,null,null,null,null,null,null,null,null,null,null,null,null,null,null,null,null,null,null,"Salary Increase Budget",null,null,null,null,null,null,null,null,null,null,null,null,null,null,null,null,null,null,null,null,null,null,null,null,null,null,null,null,null,null,null,null,"Impact of Decisions",null,null,null,null,null,"Bonus Budget"]
[null,null,null,null,null,null,null,null,null,null,null,null,null,null,null,null,null,null,null,null,null,null,null,null,null,null,null,null,null,null,null,null,null,null,null,null,null,null,null,null,null,null,null,null,null,"Ratings",null,null,null,null,null,null,null,"Salary",null,null,null,null,null,null,null,null,null,"Total Shares",{"$f":"SUM(PristineInterimShares)","v":0},null,null,null,null,"Total Shares",{"$f":"SUM(PristineFinalShares)","v":0},null,null,null,null,{"$f":"SUM(ProShares)","v":0},null,null,null,null,null,null,null,"Total Shares",{"$f":"SUM(FinalShares)","v":0},null,null,null,null,null,null,null,null,null,null,null,null,null,"Salary Increase Fund",{"$f":"SalInterimBudget","v":0},{"$f":"SalInterimBudPct","v":0},"% of Budget",null,null,null,null,null,null,null,null,null,null,null,null,null,null,null,null,null,null,null,null,null,null,"Bonus",null,null,null,null,"Employees Eligible for Bonus",{"$f":"SUMPRODUCT((Rating>0)*(BonusEligible=\"Yes\")*1)","v":0},null,null,null,null,null,"Total Bonus Funding",{"$f":"BonInterimBudget","v":0},"% of Budget"]
[null,null,null,null,null,null,null,null,null,null,null,null,null,null,null,null,null,null,null,null,null,null,null,null,null,null,null,null,null,null,null,null,null,null,null,null,null,null,null,null,null,null,null,null,null,null,null,null,null,null,null,null,null,"Incr",null,null,null,null,null,null,null,null,null,"Interim SV",{"$f":"IF($BM$2>0,SalInterimBudget/BM2,0)","v":0},null,null,null,null,"Final SV",{"$f":"IF($BS$2>0,(SalInterimBudget-SUM(BQ12:BQ13))/BS2,0)","v":0},null,null,null,null,{"$f":"IF($BX$2>0,SalFund/BX2,0)","v":0},null,null,null,null,null,null,null,"Final SV",{"$f":"IF($CG$2>0,(SalFund-SUM(CE12:CE13)+IF(SalAdjust<0,-SalAdjust,IF(SalAdjPot<0,SalAdjPot,0)))/CG2,0)","v":0},null,null,null,null,null,null,null,null,null,null,null,null,null,"Funds Allocated via Algorithm",{"$f":"SUM(CH12:CH13)","v":0},{"$f":"IF(CV2=0,0,(CV3/CV2)*CW2)","v":0},{"$f":"IF($CW$2=0,0,$CW$3/$CW$2)","v":0},null,null,null,null,null,null,null,null,null,null,null,null,null,null,null,null,null,null,null,null,null,null,null,null,null,null,null,"Employees Receiving Bonus",{"$f":"COUNTIF(TotalBonus,\">0\")","v":0},{"$f":"IF(SUMPRODUCT((Rating>0)*(BonusEligible=\"Yes\")*1)=0,0,$EA$3/SUMPRODUCT((Rating>0)*(BonusEligible=\"Yes\")*1))","v":0},null,null,null,null,"Allocated Via Algorithm",{"$f":"SUM(InitialBonus)","v":0},{"$f":"IF(EH$2=0,0,EH3/EH$2)","v":0}]
[null,null,null,null,null,null,null,null,null,null,null,null,null,null,null,null,null,null,null,null,null,null,null,null,null,null,null,null,null,null,null,null,null,null,null,null,null,null,null,null,null,null,null,null,null,null,null,null,null,null,null,null,null,null,null,null,null,null,null,null,null,null,null,null,null,null,null,null,null,null,null,null,null,null,null,null,null,null,null,null,null,null,null,null,null,null,null,null,null,null,null,null,null,null,null,null,null,null,"Funds Allocated via Adjustment",{"$f":"SUM(CK12:CK13)","v":0},{"$f":"IF(CV2=0,0,(CV4/CV2)*CW2)","v":0},{"$f":"IF($CW$2=0,0,CW4/CW2)","v":0},null,null,null,null,null,null,null,null,null,null,null,null,null,null,null,null,null,null,null,null,null,null,null,null,null,null,null,"Min Bonus",{"$f":"IF(COUNTIF(TotalBonus,\">0\")=0,0,LARGE(TotalBonus,COUNTIF(TotalBonus,\">0\")))","v":0},{"$f":"IF(COUNTIF(TotalBonusPer,\">0\")=0,0,LARGE(TotalBonusPer,COUNTIF(TotalBonusPer,\">0\")))","v":0},"of band midpoint",null,null,null,"Allocated Via Adjustment",{"$f":"EF10","v":0},{"$f":"IF(EH$2=0,0,EH4/EH$2)","v":0}]
[null,null,null,null,null,null,null,null,null,null,null,null,null,null,null,null,null,null,null,null,null,null,null,null,null,null,null,null,null,null,null,null,null,null,null,null,null,null,null,null,null,null,null,null,null,null,null,null,null,null,null,null,null,null,null,null,null,null,null,null,null,null,null,null,null,null,null,null,null,null,null,null,null,null,null,null,null,null,null,null,null,null,null,null,null,null,null,null,null,null,null,null,null,null,null,null,null,null,"Total Funds Allocated",{"$f":"SUM(CV3:CV4)","v":0},{"$f":"IF(CV2=0,0,(CV5/CV2)*CW2)","v":0},null,null,null,null,null,null,null,null,null,null,null,null,null,null,null,null,null,null,null,null,null,null,null,{"$f":"BonusMaximum","v":25000},null,null,null,null,"Max Bonus",{"$f":"MAX(TotalBonus)","v":0},{"$f":"MAX(TotalBonusPer)","v":0},"of band midpoint",null,null,null,"Total Funds Allocated",{"$f":"SUM(EH3:EH4)","v":0},{"$f":"IF(EH$2=0,0,EH5/EH$2)","v":0},null,null,null,null,null,null,null,null,null,null,null,null,null,null,null,null,null,null,0,0]
[null,null,null,null,null,null,null,null,null,null,null,null,null,null,null,null,null,null,null,null,null,null,null,null,null,null,null,null,null,null,null,null,null,null,null,null,null,null,null,null,null,null,null,null,null,null,null,null,null,null,null,null,null,null,null,null,null,null,null,null,null,null,null,null,null,null,null,null,null,null,null,null,null,null,null,null,null,null,null,null,null,null,null,null,null,null,null,null,null,null,null,null,null,null,null,null,null,null,"Funds Remaining",{"$f":"CV2-CV5","v":0},{"$f":"CW2-CW5","v":0},{"$f":"1-SUM(CX3:CX4)","v":1},null,null,null,null,null,null,null,null,null,null,null,null,null,null,null,null,null,null,null,null,null,null,null,null,null,null,null,null,null,null,null,null,null,null,"Funds Remaining",{"$f":"EH2-EH5","v":0},{"$f":"IF(EH$2=0,0,EH6/EH$2)","v":0},null,null,null,null,null,null,null,null,null,null,null,null,null,null,null,null,null,null,1,"0,1"]
{"$rows_left_out":26}
{"sheet":"Bonus Adjustment Summary","index":3,"n_rows":5,"n_cols":10,"rows_kept":5,"cut":false,"hidden":false,"merged":[]}
[]
[]
["Last Name","First Name","Employee ID","Overall Rating","Bonus\nProrated?","Bonus Overridden?","Bonus\nAdjusted?","Bonus Adjustment Justification","Emp Rownum","Perm Hidden"]
[null,null,null,null,null,null,null,null,null,{"$f":"IF(ISBLANK($A4),\"\",SUBSTITUTE(VLOOKUP($C4,'Pay Pool Panel'!$C$12:$FH$13,MATCH(J$3,'Pay Pool Panel'!$C$11:$FH$11,0),FALSE),\"0\",\"\"))","v":""}]
[null,null,null,{"$f":"INDEX(AverageRating,I5,1)","v":{"$error":"#N/A"}},{"$f":"IF(INDEX(BonShareProPct,I5,1)<>0,\"Yes\",\"\")","v":{"$error":"#N/A"}},{"$f":"IF(INDEX(BonusOverride,I5,1)=\"Yes\",\"Yes\",\"\")","v":{"$error":"#N/A"}},{"$f":"IF(INDEX(BonAdj,I5,1)=0,\"\",\"Yes\")","v":{"$error":"#N/A"}},{"$f":"IF(INDEX(BonAdjJust,I5,1)=0,\"\",INDEX(BonAdjJust,I5,1))","v":{"$error":"#N/A"}},{"$f":"MATCH(C5,EmployeeID,0)","v":{"$error":"#N/A"}},{"$f":"IF(ISBLANK($A5),\"\",SUBSTITUTE(VLOOKUP($C5,'Pay Pool Panel'!$C$12:$FH$13,MATCH(J$3,'Pay Pool Panel'!$C$11:$FH$11,0),FALSE),\"0\",\"\"))","v":""}]

{"sheet":"Pay Bands","index":4,"n_rows":191,"n_cols":34,"rows_kept":191,"cut":false,"hidden":false,"merged":[[3,5,16,5],[0,1,0,4],[17,5,40,5],[32,30,32,31],[32,32,32,33],[11,32,11,33],[67,18,67,22],[45,30,45,31],[45,32,45,33],[0,6,0,9],[2,30,2,31],[11,30,11,31],[2,32,2,33],[68,18,69,18],[68,19,69,19],[68,20,69,20],[68,21,69,21],[68,22,69,22]]}
[null,{"$f":"CONCATENATE(Cycle,\" Pay Band Information\")","v":"2024 Pay Band Information"},null,null,null,null,{"$f":"CONCATENATE(Cycle+1,\" Pay Band Information\")","v":"2025 Pay Band Information"},null,null,null,null,null,null,null,null,{"$f":"CONCATENATE(Cycle+0,\"  version\")","v":"2024  version"},null,null,null,null,null,{"$f":"CONCATENATE(Cycle+1,\"  version\")","v":"2025  version"},null,null,null,"Max or ",null,"For IA and GG"]
[null,null,null,null,null,null,null,null,null,null,null,null,null,null,null,"Grade",null,"OPM Base","Increment","Step12",null,"Grade",null,"Base","Increment","Step12",null,null,"Bands"]
[null,"Pay Band","Minimum","Midpoint","Maximum",null,"Pay Band","Minimum","Midpoint","Maximum","Increment","Min RR","GPI","New \nEXIVCap","Old\nEXIVCap",1,null,21986,null,null,null,1,null,{"$f":"ROUND(R3*(1+GPI),0)","v":22206},null,null,null,null,"PayTableGrade",null,{"$f":"Cycle+1","v":2025},null,{"$f":"Cycle+2","v":2026}]
[null,"IA1",21986,{"$f":"ROUND(SUM(C4,E4)/2,0)","v":39671},57355,"Banded Systems","IA1",22206,{"$f":"ROUND(SUM(H4,J4)/2,0)","v":40068},57929,null,{"$f":"GPI","v":0.01},0.01,191900,183500,2,null,24722,null,null,null,2,null,24969,null,null,null,"Pay Band","Min","Max","Minimum","Maximum"," Minimum "," Maximum "]
[null,"IA2",41966,59609,77252,null,"IA2",42386,60206,78026,null,null,null,null,null,3,null,26975,899,36864,null,3,null,27245,{"$f":"ROUND(X5/30,0)","v":908},{"$f":"X5+11*Y5","v":37233},null,1,1,7,{"$f":"VLOOKUP($AC5,OldGSTable,3)","v":21986},{"$f":"VLOOKUP($AD5,OldGSTable,5)","v":57355},{"$f":"VLOOKUP($AC5,NewGSTable,3)","v":22206},{"$f":"VLOOKUP($AD5,NewGSTable,5)","v":57929}]
[null,"IA3",62107,91544,120981,null,"IA3",62728,92457,122185,null,null,null,null,null,4,null,30280,{"$f":"ROUND(R6/30,0)","v":1009},41379,null,4,null,30583,{"$f":"ROUND(X6/30,0)","v":1019},{"$f":"X6+11*Y6","v":41792},null,2,7,10,{"$f":"VLOOKUP($AC6,OldGSTable,3)","v":41966},{"$f":"VLOOKUP($AD6,OldGSTable,5)","v":77252},{"$f":"VLOOKUP($AC6,NewGSTable,3)","v":42386},{"$f":"VLOOKUP($AD6,NewGSTable,5)","v":78026}]
{"$rows_left_out":186}
{"sheet":"Hidden Config","index":5,"n_rows":54,"n_cols":16,"rows_kept":54,"cut":false,"hidden":true,"merged":[[0,11,0,12]]}
[null,null,null,null,null,null,"Begin Data Row","End Data Row","PPP Hide Personnel Data","PPP Hide Calc",null,"Control List for ManageListForm"]
[null,null,null,null,null,null,{"$f":"ROW(aLastName)","v":12},{"$f":"ROW(InsertHere)","v":13},{"$f":"COUNTA($I3:$I50)","v":7},{"$f":"COUNTA($J3:$J50)","v":3},null,"<select>","Blanks","Blanks","Yes"]
[null,null,null,null,null,null,null,null,"C:E","AX:BA",null,"Special Situated Condition","SpecialSC","SSC",{"$f":"SSCGate","v":"Yes"},"Tech/Admin - Entry"]
[null,null,null,null,null,null,null,null,"M:M","BE:BM",null,"Bonus Adjustment Justification","BAJList","BonAdjJust",{"$f":"BAJGate","v":"Yes"},"Tech/Admin - Full Perf."]
[null,null,null,null,null,null,null,null,"O:O","BT:BT",null,null,null,null,null,"Tech/Admin - Senior"]
[null,null,null,null,null,null,null,null,"Q:R",null,null,null,null,null,null,"Super/Mgmt - Entry"]
{"$rows_left_out":49}
{"sheet":"Summary","index":6,"n_rows":4,"n_cols":20,"rows_kept":4,"cut":false,"hidden":false,"merged":[]}
[null,null,null,null,null,{"$f":"MATCH(F$2,'Pay Pool Panel'!$C$11:$EU$11,0)","v":47},{"$f":"MATCH(G$2,'Pay Pool Panel'!$C$11:$EU$11,0)","v":48},null,{"$f":"MATCH(I$2,'Pay Pool Panel'!$C$11:$EU$11,0)","v":61},{"$f":"MATCH(J$2,'Pay Pool Panel'!$C$11:$EU$11,0)","v":97},{"$f":"MATCH(K$2,'Pay Pool Panel'!$C$11:$EU$11,0)","v":99},{"$f":"MATCH(L$2,'Pay Pool Panel'!$C$11:$EU$11,0)","v":100},{"$f":"MATCH(M$2,'Pay Pool Panel'!$C$11:$EU$11,0)","v":106},null,null,{"$f":"MATCH(P$2,'Pay Pool Panel'!$C$11:$EU$11,0)","v":136},{"$f":"MATCH(Q$2,'Pay Pool Panel'!$C$11:$EU$11,0)","v":138},{"$f":"MATCH(R$2,'Pay Pool Panel'!$C$11:$EU$11,0)","v":137},{"$f":"MATCH(S$2,'Pay Pool Panel'!$C$11:$EU$11,0)","v":141}]
["Last Name","First Name","Employee ID","Pay Band (as of Extract date)","Wildcard 1","Overall Rating","Evaluation of Record","Base Salary (as of Extract date)","End Cycle Compa Ratio","Floor Salary Incr.\n($)","Perf. Salary Incr.\n($)","Perf. Salary Incr.\n(%)","Amount\nof Other\nIncr.\n($)","Total Salary Incr. ($)\n(Includes Floor & Other)","Total Salary Incr. (%)\n(Includes Floor & Other)","Total Bonus\n($)","Total Bonus (% of Base Salary)","Total Bonus (% of Midpoint)","Estimated  $ Amount of Award","Perm Hidden"]
[null,null,null,null,null,{"$f":"IF(ISBLANK($A3),\"\",VLOOKUP($C3,'Pay Pool Panel'!$C$12:$FH$13,F$1,FALSE))","v":""},{"$f":"IF(ISBLANK($A3),\"\",VLOOKUP($C3,'Pay Pool Panel'!$C$12:$FH$13,G$1,FALSE))","v":""},null,{"$f":"IF(ISBLANK($A3),\"\",VLOOKUP($C3,'Pay Pool Panel'!$C$12:$FH$13,I$1,FALSE))","v":""},{"$f":"IF(ISBLANK($A3),\"\",VLOOKUP($C3,'Pay Pool Panel'!$C$12:$FH$13,J$1,FALSE))","v":""},{"$f":"IF(ISBLANK($A3),\"\",VLOOKUP($C3,'Pay Pool Panel'!$C$12:$FH$13,K$1,FALSE))","v":""},{"$f":"IF(ISBLANK($A3),\"\",VLOOKUP($C3,'Pay Pool Panel'!$C$12:$FH$13,L$1,FALSE))","v":""},{"$f":"IF(ISBLANK($A3),\"\",VLOOKUP($C3,'Pay Pool Panel'!$C$12:$FH$13,M$1,FALSE))","v":""},{"$f":"IF(ISBLANK($A3),\"\",J3+K3+M3)","v":""},{"$f":"IF(ISBLANK($A3),\"\",$N3/$H3)","v":""},{"$f":"IF(ISBLANK($A3),\"\",VLOOKUP($C3,'Pay Pool Panel'!$C$12:$FH$13,P$1,FALSE))","v":""},{"$f":"IF(ISBLANK($A3),\"\",VLOOKUP($C3,'Pay Pool Panel'!$C$12:$FH$13,Q$1,FALSE))","v":""},{"$f":"IF(ISBLANK($A3),\"\",VLOOKUP($C3,'Pay Pool Panel'!$C$12:$FH$13,R$1,FALSE))","v":""},{"$f":"IF(ISBLANK($A3),\"\",VLOOKUP($C3,'Pay Pool Panel'!$C$12:$FH$13,S$1,FALSE))","v":""},{"$f":"IF(ISBLANK($A3),\"\",SUBSTITUTE(VLOOKUP($C3,'Pay Pool Panel'!$C$12:$FH$13,MATCH(T$2,'Pay Pool Panel'!$C$11:$FH$11,0),FALSE),\"0\",\"\"))","v":""}]
[null,null,null,null,null,{"$f":"IF(ISBLANK($A4),\"\",VLOOKUP($C4,'Pay Pool Panel'!$C$12:$FH$13,F$1,FALSE))","v":""},{"$f":"IF(ISBLANK($A4),\"\",VLOOKUP($C4,'Pay Pool Panel'!$C$12:$FH$13,G$1,FALSE))","v":""},null,{"$f":"IF(ISBLANK($A4),\"\",VLOOKUP($C4,'Pay Pool Panel'!$C$12:$FH$13,I$1,FALSE))","v":""},{"$f":"IF(ISBLANK($A4),\"\",VLOOKUP($C4,'Pay Pool Panel'!$C$12:$FH$13,J$1,FALSE))","v":""},{"$f":"IF(ISBLANK($A4),\"\",VLOOKUP($C4,'Pay Pool Panel'!$C$12:$FH$13,K$1,FALSE))","v":""},{"$f":"IF(ISBLANK($A4),\"\",VLOOKUP($C4,'Pay Pool Panel'!$C$12:$FH$13,L$1,FALSE))","v":""},{"$f":"IF(ISBLANK($A4),\"\",VLOOKUP($C4,'Pay Pool Panel'!$C$12:$FH$13,M$1,FALSE))","v":""},{"$f":"IF(ISBLANK($A4),\"\",J4+K4+M4)","v":""},{"$f":"IF(ISBLANK($A4),\"\",$N4/$H4)","v":""},{"$f":"IF(ISBLANK($A4),\"\",VLOOKUP($C4,'Pay Pool Panel'!$C$12:$FH$13,P$1,FALSE))","v":""},{"$f":"IF(ISBLANK($A4),\"\",VLOOKUP($C4,'Pay Pool Panel'!$C$12:$FH$13,Q$1,FALSE))","v":""},{"$f":"IF(ISBLANK($A4),\"\",VLOOKUP($C4,'Pay Pool Panel'!$C$12:$FH$13,R$1,FALSE))","v":""},{"$f":"IF(ISBLANK($A4),\"\",VLOOKUP($C4,'Pay Pool Panel'!$C$12:$FH$13,S$1,FALSE))","v":""},{"$f":"IF(ISBLANK($A4),\"\",SUBSTITUTE(VLOOKUP($C4,'Pay Pool Panel'!$C$12:$FH$13,MATCH(T$2,'Pay Pool Panel'!$C$11:$FH$11,0),FALSE),\"0\",\"\"))","v":""}]

{"sheet":"Rating Statistics","index":7,"n_rows":28,"n_cols":8,"rows_kept":28,"cut":false,"hidden":false,"merged":[[3,4,3,5],[3,3,4,3],[1,2,1,6],[3,2,4,2]]}
[]
[null,null,{"$f":"CONCATENATE(\"Rating Statistics for Pay Pool \",PPID)","v":"Rating Statistics for Pay Pool "}]
[]
[null,null,"Mean Objective Rating","Mean Element Rating","Overall Rating"]
[null,null,null,null,"Mean","Std Dev","Number of Employees","Employees Rated"]
[]
{"$rows_left_out":23}
{"sheet":"Rating Charts","index":8,"n_rows":61,"n_cols":28,"rows_kept":61,"cut":false,"hidden":false,"merged":[[29,20,29,25]]}
[null,null,null,null,null,null,null,null,null,"Rating Charts"]
[null,null,null,null,null,null,null,null,null,{"$f":"PPID","v":""},null,null,null,null,null,null,null,null,null,null,"Pick the Pay Plan to Analyze  >>>",null,null,"IA"]
[null,null,null,null,null,null,null,null,null,null,null,null,null,null,null,null,null,null,null,null,null,null,null,null,null,null,null,"IA"]
[null,null,null,null,null,null,null,null,null,null,null,null,null,null,null,null,null,null,null,null,null,null,null,null,null,null,null,"PI"]
[null,null,"Ratings","Count","Percent",null,null,null,null,null,null,null,null,null,null,null,null,null,null,null,null,{"$f":"CONCATENATE(\"Percent of \", U6)","v":"Percent of Grade"}]
[null,"Unacceptable",1,{"$f":"COUNTIF(Rating,1)","v":0},{"$f":"D6/$D$11","v":{"$error":"#DIV/0!"}},null,null,null,null,null,null,"(0",null,null,null,null,null,null,null,null,{"$f":"IF(isNGAMode,\"Pay Band\",\"Grade\")","v":"Grade"},"Rated 1","Rated 2","Rated 3","Rated 4","Rated 5"]
{"$rows_left_out":56}
{"sheet":"Hidden Sal Inc Rates","index":9,"n_rows":37,"n_cols":8,"rows_kept":37,"cut":false,"hidden":true,"merged":[]}
[null,"Rating Range","Payout Range",null,null,"Bonus Share Info"]
["Low",2.6,0]
["High",5,0.06,null,null,"Min Shares",1]
["Range",{"$f":"B3-B2","v":2.4},0.06,null,null,"Total Shares",{"$f":"SUM(BonusSharesFinal)","v":0}]
["Incr",0.1,null,null,null,"Share Value",{"$f":"IF(OR(SumBonusElig=0,'Hidden Sal Inc Rates'!G4=0),0,MAX(0,(bonusfund+IF(BonAdjust<0,-BonAdjust,IF(BonAdjPot<0,BonAdjPot,0))))/SUMPRODUCT(BandMidpoints,BonusSharesFinal))","v":0}]
["# of Incr",{"$f":"1+B4/B5","v":24.999999999999996}]
{"$rows_left_out":32}
{"sheet":"Salary Increase Statistics","index":10,"n_rows":27,"n_cols":12,"rows_kept":27,"cut":false,"hidden":true,"merged":[[2,10,3,10],[1,4,1,8],[2,2,3,2],[2,11,3,11],[2,7,3,7],[2,8,3,8],[2,3,3,3],[2,4,3,4],[2,5,3,5],[2,6,3,6],[2,9,3,9]]}
[null,null,null,null,null,null,{"$f":"CONCATENATE(\"Salary Increase Statistics for Pay Pool \",PPID)","v":"Salary Increase Statistics for Pay Pool "}]
[null,null,null,null,"Mean Statistics include only employees receiving a salary increase"]
[null,null,"Mean Overall Rating","Mean Base Salary","Mean\nCompa Ratio","Mean Perf. Salary Increase\n($)","Mean Perf. Salary Increase\n(%)","Mean Total Salary Increase\n($)","Mean Total Salary Increase\n(%)","Total Number\nof\nEmployees","Number of Employees Rated and Eligible","Employees Rcv Perf Salary Increase"]
[]
[]
[null,"Entire Pay Pool",{"$f":"IF($K6=0,\"\",SUMPRODUCT((UseInAnalysis=1)*AverageRating)/$K6)","v":""},{"$f":"IF($K6=0,\"\",SUMPRODUCT((UseInAnalysis=1)*BasePay)/$K6)","v":""},{"$f":"IF($K6=0,\"\",SUMPRODUCT((UseInAnalysis=1)*CompaRatio)/$K6)","v":""},{"$f":"IF($K6=0,\"\",SUMPRODUCT((UseInAnalysis=1)*FinalSalIncDoll)/$K6)","v":""},{"$f":"IF($K6=0,\"\",SUMPRODUCT((UseInAnalysis=1)*FinalSalIncPer)/$K6)","v":""},{"$f":"IF($K6=0,\"\",SUMPRODUCT((UseInAnalysis=1)*TotalSalIncDol)/$K6)","v":""},{"$f":"IF($K6=0,\"\",SUMPRODUCT((UseInAnalysis=1)*TotalSalIncPer)/$K6)","v":""},{"$f":"EmpCount","v":0},{"$f":"COUNTIF(UseInAnalysis,\"=1\")","v":0},{"$f":"COUNTIF(FinalSalIncDoll,\">0\")","v":0}]
{"$rows_left_out":22}
{"sheet":"Hidden Combo Chart","index":11,"n_rows":0,"n_cols":0,"rows_kept":0,"cut":false,"hidden":true,"merged":[]}

{"sheet":"Salary Increase Charts","index":12,"n_rows":61,"n_cols":14,"rows_kept":61,"cut":false,"hidden":true,"merged":[]}
[null,null,null,null,null,null,null,null,null,null,"Salary Increase Charts"]
[null,null,null,null,null,null,null,null,null,null,{"$f":"PPID","v":""}]
[]
[]
[]
[]
{"$rows_left_out":56}
{"sheet":"Total Salary Increase Charts","index":13,"n_rows":58,"n_cols":14,"rows_kept":58,"cut":false,"hidden":true,"merged":[]}
[null,null,null,null,null,null,null,null,null,null,"Total Salary Increase Charts"]
[null,null,null,null,null,null,null,null,null,null,{"$f":"PPID","v":""}]
[]
[]
[null,null,null,null,null,null,null,null,"% for Salary","Count for Salary"]
[null,null,null,null,null,null,null,null,null,null,0]
{"$rows_left_out":53}
{"sheet":"Bonus Statistics","index":14,"n_rows":27,"n_cols":11,"rows_kept":27,"cut":false,"hidden":false,"merged":[]}
[null,null,null,null,null,"Bonus Statistics"]
[null,null,null,null,null,"Includes Employees Receiving a Bonus"]
[]
[null,null,"Mean Overall Rating","Mean Base Salary","Mean\nCompa Ratio","Mean Bonus ($)","Mean Bonus (% of Midpoint)","Employees Rated","Number of Employees Rated and Bonus Eligible","Employees Receiving Bonus","Pct of Employees with Bonus"]
[]
[null,"Entire Pay Pool",{"$f":"IF($J6=0,\"\",SUMPRODUCT((TotalBonus>0)*AverageRating)/$J6)","v":""},{"$f":"IF($J6=0,\"\",SUMPRODUCT((TotalBonus>0)*BasePay)/$J6)","v":""},{"$f":"IF($J6=0,\"\",SUMPRODUCT((TotalBonus>0)*CompaRatio)/$J6)","v":""},{"$f":"IF($J6=0,\"\",SUM(TotalBonus)/$J6)","v":""},{"$f":"IF($J6=0,\"\",SUM(TotalBonusPer)/$J6)","v":""},{"$f":"COUNTIF(Rating,\">0\")","v":0},{"$f":"SUMPRODUCT((Rating>0)*(BonusEligible=\"Yes\")*1)","v":0},{"$f":"COUNTIF(TotalBonus,\">0\")","v":0},{"$f":"IF($I6=0,\"\",$J6/$I6)","v":""}]
{"$rows_left_out":22}
{"sheet":"Bonus Charts","index":15,"n_rows":138,"n_cols":13,"rows_kept":138,"cut":false,"hidden":false,"merged":[[1,9,1,10]]}
[null,null,null,null,null,null,null,null,null,"Bonus Charts"]
[null,null,null,null,null,null,null,null,null,{"$f":"PPID","v":""}]
[]
[null,null,"% of Midpoint","Count for Midpoint","% for Salary","Count for Bonus"]
[null,null,null,null,null,null,0]
[null,"0 to 1 %",{"$f":"IF($D$17>0,$D6/$D$17)","v":false},{"$f":"SUMPRODUCT((TotalBonusPer>G5)*(TotalBonusPer<=G6))","v":0},{"$f":"IF($F$17>0,$F6/$F$17)","v":false},{"$f":"SUMPRODUCT((TotalBonusPerBP>G5)*(TotalBonusPerBP<=G6))","v":0},0.01]
{"$rows_left_out":133}
{"sheet":"OpenSheet","index":16,"n_rows":0,"n_cols":0,"rows_kept":0,"cut":false,"hidden":false,"merged":[]}

{"sheet":"Hidden Work","index":17,"n_rows":0,"n_cols":0,"rows_kept":0,"cut":false,"hidden":true,"merged":[]}

{"sheet":"Hidden Employee Notices","index":18,"n_rows":53,"n_cols":16,"rows_kept":53,"cut":false,"hidden":true,"merged":[[6,2,6,13],[20,2,30,6],[20,18,33,22]]}
[null,"Employee Performance Pay Feedback (estimate*)"]
[]
[null,null,"Name:",null,"Leah Yung",null,"Work Role:","Electronics Engineer",null,null,null,null,"Appraisal Period:"]
[null,null,"Organization:",null,"OFC/CCC",null,"Work Category:","Professional",null,null,null,null,"1-Oct-14 to 30-Sep-15"]
[null,null,"Pay Pool ID:",null,"PP001",null,"Pay Band:",4,null,null,null,null,"Payout Effective Date:"]
[null,null,null,null,null,null,null,null,null,null,null,null,"2016-01-10"]
{"$rows_left_out":48}
{"sheet":"Hidden Employee Bonus Notices","index":19,"n_rows":398,"n_cols":23,"rows_kept":398,"cut":false,"hidden":true,"merged":[[6,2,6,13],[34,6,34,9],[18,2,31,6],[5,11,5,12]]}
[null,"Employee Performance Pay Feedback (estimate*)"]
[]
[null,null,"Name:",null,"Erwin Schrodinger",null,"Work Role:",null,"Intelligence Operations Specialist",null,null,null,"Appraisal Period:"]
[null,null,"Organization:",null,"OFA/AAA",null,"Work Category:",null,"Professional",null,null,null,"1-Oct-15 to 30-Sep-16"]
[null,null,"Pay Pool ID:",null,"PP005",null,"Grade:",null,4,null,null,null,"Payout Effective Date:"]
[null,null,null,null,null,null,null,null,null,null,null,"2017-01-08"]
{"$rows_left_out":392}